SURVEY_STATIC_ID,REGISTRANT_CODE,RESPONSE_ID,STARTED_ON,STARTED_ON_TIME,DAYS_SINCE,DIARRHEA,GROIN_UNDERARM_SWELLING,IRRITABILITY,LOSS_OF_APPETITE,SLEEPINESS,FEELING_TODAY,FEVER,HAD_SYMPTOMS,HEALTH_IMPACT,HEALTH_NOW,HEALTH_NOW_COMPARISON,VACCINE_CAUSED_HEALTH_ISSUES,HEALTHCARE_VISITS,PAIN,RASH_OUTSIDE_INJECTION_SITE,REDNESS,SITE_REACTION,SWELLING,SYSTEMIC_REACTION,TEMPERATURE_CELSIUS,TEMPERATURE_FAHRENHEIT,TEMPERATURE_READING,TESTED_POSITIVE,TESTED_POSITIVE_DATE,VOMITING,DURATION_MINS,PREFERRED_LANGUAGE
vsafe-6-month-dose2-under-3,YPH-16004-38574,s300266738162803011369109882098982464236,06/20/2022,1:47:49 PM,186,,,,,,Good,,No,,,About the same,,,,,,,,,,,,No,,,0.32,English
vsafe-21-day-dose1-mod-under-3,X39-20593-64636,s300274719326714918132502926656499492070,06/20/2022,12:23:07 PM,27,,,,,,Good,,No,,,,,,,,,,,,,,,No,,,0.30,English
vsafe-0-day-dose1-under-3,QHJ-11184-70002,s300296905398019101983564806304974907915,06/20/2022,6:29:17 PM,0,,,Mild,,Moderate,Fair,No,,N/A,,,,,,Mild,,None,,"Sleepiness:Irritability/crying:Rash, not including the immediate area around the injection site",,,,,,,1.63,English
vsafe-0-day-dose1-under-3,XEK-12085-54005,s300300194751295690572062117761196404011,06/20/2022,7:06:53 PM,0,,,,,,Good,No,,Be unable to work or attend school,,,,,,,,None,,None,,,,,,,0.32,English
vsafe-0-day-dose1-under-3,6NM-47975-35703,s300309360911660802244703107193162572741,06/20/2022,9:31:16 PM,0,Mild,,,,,Good,No,,N/A,,,,,,,,None,,Diarrhea,,,,,,,0.62,English
vsafe-0-day-dose1-under-3,42M-21747-39171,s300311482457610077413683931144983860998,06/20/2022,8:52:32 PM,0,,,,,,Good,No,,N/A,,,,,,,,None,,None,,,,,,,0.33,English
vsafe-35-day-dose3-under-3,ANW-12173-94759,s300373344505914673709264249600929889056,06/21/2022,1:48:28 PM,36,,,,,,Good,,No,,,,,,,,,,,,,,,No,,,0.20,English
vsafe-0-day-dose1-under-3,DVR-27515-83535,s300374025623737784060196842653149192137,06/21/2022,2:00:24 PM,0,,,,,,Good,No,,N/A,,,,,Mild,,,Pain,,None,,,,,,,0.38,English
vsafe-0-day-dose1-under-3,XJX-21644-84941,s300373849278830301506504354213694977192,06/21/2022,2:05:27 PM,0,,,,,,Good,No,,N/A,,,,,,,,None,,None,,,,,,,0.77,English
vsafe-0-day-dose1-under-3,UXU-16620-10117,s300374632974067640629347727507251145871,06/21/2022,2:05:33 PM,0,,,Mild,,,Good,No,,N/A,,,,,,,,None,,Irritability/crying,,,,,,,0.47,English
vsafe-0-day-dose1-under-3,NKF-32517-29522,s300374463642757999249198978248978631613,06/21/2022,2:05:35 PM,0,,,Moderate,,,Fair,No,,N/A,,,,,Moderate,,Moderate,Pain:Redness:Swelling/hardness,Moderate,Irritability/crying,,,,,,,0.90,English
vsafe-0-day-dose1-under-3,VJA-60589-23708,s300374348709622582601598736364775044117,06/21/2022,2:05:37 PM,0,,,,,,Good,No,,N/A,,,,,,,,None,,None,,,,,,,0.58,English
vsafe-0-day-dose1-under-3,6AJ-63448-68558,s300373849279041863524936914319268557992,06/21/2022,2:06:02 PM,0,,,,,,Good,No,,N/A,,,,,Mild,,,Pain,,None,,,,,,,1.78,English
vsafe-0-day-dose1-under-3,EMV-17104-06971,s300373849279110772296654948182226810024,06/21/2022,2:06:11 PM,0,,,,,,Good,No,,N/A,,,,,,,,None,,None,,,,,,,1.15,English
vsafe-0-day-dose1-under-3,GVL-15147-13723,s300374840483171404916410995554374049438,06/21/2022,2:09:40 PM,0,,,,,,Good,No,,N/A,,,,,,,,None,,None,,,,,,,0.35,English
vsafe-0-day-dose1-under-3,ANB-28118-59084,s300361364800414025809933781574022260820,06/21/2022,2:10:41 PM,0,,,,,Mild,Good,No,,N/A,,,,,,,,None,,Sleepiness,,,,,,,0.63,English
vsafe-0-day-dose1-under-3,ZBC-16059-70808,s300375111928500724799095221897753411162,06/21/2022,2:11:07 PM,0,,,Mild,,Mild,Fair,No,,N/A,,,,,,,,None,,Sleepiness:Irritability/crying,,,,,,,0.50,English
vsafe-0-day-dose1-under-3,8SP-31384-18118,s300375117520075278908423976218562040249,06/21/2022,2:11:40 PM,0,,,,,,Good,No,,N/A,,,,,,,,None,,None,,,,,,,0.25,English
vsafe-0-day-dose1-under-3,A4D-21257-02363,s300375117520170784048173531923363828153,06/21/2022,2:11:50 PM,0,,,,,Mild,Good,No,,N/A,,,,,,,,None,,Sleepiness,,,,,,,1.75,English
vsafe-0-day-dose1-under-3,2XT-29121-63443,s300375198158864923437479647377065947618,06/21/2022,2:12:59 PM,0,,,,,,Good,No,,N/A,,,,,,,,None,,None,,,,,,,0.22,English
vsafe-1-6-daily-dose1-under-3,EL4-29940-41470,s300374985395580454198764641191314756337,06/21/2022,2:13:33 PM,1,,,,,Mild,Good,No,,N/A,,,,,Mild,,,Pain,,Sleepiness,,,,,,,0.43,English
vsafe-0-day-dose1-under-3,W8R-24567-02335,s300375255257202921563629617360273026371,06/21/2022,2:14:44 PM,0,,,,,Mild,Fair,Yes,,Be unable to work or attend school,,,,,,,,None,,Sleepiness,38.3,101.0,Yes - in degrees Fahrenheit,,,,1.27,English
vsafe-0-day-dose1-under-3,Y5Q-24478-78585,s300375554990895176884036214568811910822,06/21/2022,2:18:07 PM,0,,,,,,Good,No,,N/A,,,,,Mild,,,Pain,,None,,,,,,,0.48,English
vsafe-0-day-dose1-under-3,HC7-21672-63825,s300374809499947266385993716433821541601,06/21/2022,2:19:58 PM,0,,,Mild,,,Good,No,,N/A,,,,,,,,None,,Irritability/crying,,,,,,,0.57,English
vsafe-0-day-dose1-under-3,74L-52325-66296,s300375480887484928041197934121635693667,06/21/2022,2:20:11 PM,0,,,,,,Good,No,,N/A,,,,,,,,None,,None,,,,,,,0.25,English
vsafe-0-day-dose1-under-3,R4T-20127-97509,s300375911834633640701449344440976671937,06/21/2022,2:27:59 PM,0,,,Moderate,,,Good,No,,Be unable to work or attend school,,,,,,,,None,,Irritability/crying,,,,,,,0.62,English
vsafe-0-day-dose1-under-3,UV7-15504-79523,s300376308524715363047608227640604493703,06/21/2022,2:29:04 PM,0,,,,,,Good,No,,N/A,,,,,,,,None,,None,,,,,,,0.18,English
vsafe-0-day-dose1-under-3,K6N-31339-67554,s300376418358111607872138168759533357081,06/21/2022,2:31:57 PM,0,,,,,,Good,No,,N/A,,,,,,,,None,,None,,,,,,,0.47,English
vsafe-0-day-dose1-under-3,A52-96710-23856,s300377358596279289526810752007080162516,06/21/2022,2:44:06 PM,0,,,,,,Good,No,,N/A,,,,,Mild,,,Pain,,None,,,,,,,0.50,English
vsafe-0-day-dose1-under-3,DLX-13978-16611,s300377742200915948046849205195724466085,06/21/2022,2:47:24 PM,0,,,,,,Good,No,,N/A,,,,,,,,None,,None,,,,,,,0.27,English
vsafe-0-day-dose1-under-3,RVT-37135-57690,s300377860592923940667025553030065553725,06/21/2022,2:52:00 PM,0,,,,,,Good,No,,N/A,,,,,,,,None,,None,,,,,,,0.45,English
vsafe-0-day-dose1-under-3,RLE-46140-40765,s300378179350176782161923769688031685926,06/21/2022,2:53:26 PM,0,,,,,,Good,No,,N/A,,,,,,,,None,,None,,,,,,,0.30,English
vsafe-0-day-dose1-under-3,9XP-33533-50244,s300378259679965347683752912223694629510,06/21/2022,3:02:54 PM,0,,,Mild,,,Good,No,,N/A,,,,,,,,None,,Irritability/crying,,,,,,,0.47,English
vsafe-0-day-dose1-under-3,QEX-10969-72808,s300378883362914440963343574375772881213,06/21/2022,2:04:50 PM,0,,,,,,Good,No,,N/A,,,,,,,,None,,None,,,,,,,0.48,English
vsafe-0-day-dose1-under-3,CZ5-26169-59808,s300378922471768637293507243085641991161,06/21/2022,2:06:22 PM,0,,,,,,Good,No,,N/A,,,,,,,,None,,None,,,,,,,0.27,English
vsafe-0-day-dose1-under-3,N8P-32461-39156,s300376863750531686975249557359002519240,06/21/2022,2:06:44 PM,0,,,,,,Good,No,,N/A,,,,,,,,None,,None,,,,,,,0.45,English
vsafe-0-day-dose1-under-3,QWX-26148-03155,s300378940169080250932182690010430619052,06/21/2022,3:07:01 PM,0,,,,,,Good,No,,N/A,,,,,,,,None,,None,,,,,,,0.27,English
vsafe-0-day-dose1-under-3,WTA-20762-41108,s300379146898233912959783994684399598544,06/21/2022,3:08:22 PM,0,,,Mild,,,Good,No,,N/A,,,,,,,,None,,Irritability/crying,,,,,,,0.50,English
vsafe-0-day-dose1-under-3,Y89-81438-87719,s300379153957912737632434279647032269885,06/21/2022,2:09:45 PM,0,,,,,,Good,No,,N/A,,,,,,,,None,,None,,,,,,,0.43,English
vsafe-0-day-dose1-under-3,SDF-18353-21167,s300379081604398422119655557970726157463,06/21/2022,2:10:15 PM,0,,,,,,Good,No,,N/A,,,,,,,,None,,None,,,,,,,0.72,English
vsafe-0-day-dose1-under-3,LQ8-27384-77467,s300379153958449500696343175000601812029,06/21/2022,2:10:42 PM,0,,,,,,Good,No,,N/A,,,,,Mild,,,Pain,,None,,,,,,,1.18,English
vsafe-1-6-daily-dose1-under-3,TAW-17218-78412,s300379154224394644690098661950761918908,06/21/2022,2:11:46 PM,1,,,,,Mild,Good,No,,N/A,,,,,Mild,,,Pain,,Sleepiness,,,,,,,0.68,English
vsafe-0-day-dose1-under-3,AHM-25141-36340,s300378941699501933390289300475098075244,06/21/2022,2:12:50 PM,0,,,,,Mild,Good,No,,N/A,,,,,,,,None,,Sleepiness,,,,,,,0.33,English
vsafe-0-day-dose1-under-3,B34-29030-06507,s300379154790000082626258829310373287915,06/21/2022,2:16:54 PM,0,,,,,,Good,No,,N/A,,,,,,,,None,,None,,,,,,,10.77,English
vsafe-1-6-daily-dose1-under-3,AJY-14824-90234,s300379918641918136048593109568549713798,06/21/2022,2:23:27 PM,1,,,,,,Good,No,,N/A,,,,,,,,None,,None,,,,,,,0.33,English
vsafe-0-day-dose1-under-3,NDB-33713-36880,s300380172416812999117695413677191737643,06/21/2022,2:27:23 PM,0,,,,,,Good,No,,N/A,,,,,,,,None,,None,,,,,,,0.92,English
vsafe-0-day-dose1-under-3,U6R-20559-41684,s300380167810685758354609394130908491046,06/21/2022,2:28:45 PM,0,,,,,,Good,No,,N/A,,,,,Moderate,,,Pain,,None,,,,,,,0.58,English
vsafe-0-day-dose1-under-3,28Z-79954-00696,s300380171744677910816400779132189446948,06/21/2022,3:32:56 PM,0,,,,,,Good,No,,N/A,,,,,,,,None,,None,,,,,,,0.57,English
vsafe-1-6-daily-dose1-under-3,68V-21360-59421,s300380171744740774959020739849274168100,06/21/2022,2:33:12 PM,1,,,,,,Good,No,,N/A,,,,,,Mild,,None,,"Rash, not including the immediate area around the injection site",,,,,,,0.70,English
vsafe-0-day-dose1-under-3,PMK-51809-08383,s300379220301919975619862251830214587438,06/21/2022,3:37:40 PM,0,,,,,,Good,No,,N/A,,,,,,,,None,,None,,,,,,,1.37,English
vsafe-0-day-dose1-under-3,MHM-11474-79720,s300381900118890411865196138491930103803,06/21/2022,3:47:35 PM,0,,,Mild,,,Fair,No,,N/A,,,,,,,Mild,Redness,,Irritability/crying,,,,,,,1.43,English
vsafe-0-day-dose1-under-3,GCF-25507-01163,s300381900119257925314358985761040781307,06/21/2022,2:49:29 PM,0,,,,,,Good,No,,N/A,,,,,,,,None,,,,,,,,,0.90,English
vsafe-0-day-dose1-under-3,3HU-26272-86200,s300382349756666816263384208542247039150,06/21/2022,2:57:28 PM,0,,,,,Mild,Good,No,,N/A,,,,,,,,None,,Sleepiness,,,,,,,0.57,English
vsafe-0-day-dose1-under-3,T3L-53250-93653,s300383318494913965553623423465921614780,06/21/2022,4:04:38 PM,0,,,,,,Good,No,,N/A,,,,,,,,None,,None,,,,,,,0.58,English
vsafe-0-day-dose1-under-3,T62-16390-77349,s300382325189738399731262259406310142366,06/21/2022,3:04:49 PM,0,,,,,,Good,No,,N/A,,,,,,,,None,,None,,,,,,,0.47,English
vsafe-0-day-dose1-under-3,D67-20566-24560,s300383839896275340208134957762127512184,06/21/2022,2:15:23 PM,0,,,,,,Good,No,,N/A,,,,,,,,None,,None,,,,,,,0.40,English
vsafe-0-day-dose1-under-3,UC9-28622-93366,s300383839896309190131084167379019285112,06/21/2022,3:15:38 PM,0,,,,,,Good,No,,N/A,,,,,,,,None,,None,,,,,,,0.48,English
vsafe-0-day-dose1-under-3,3U2-29969-75390,s300384432152417783849187520286231804188,06/21/2022,3:19:47 PM,0,,,,,,Good,No,,N/A,,,,,,,,None,,None,,,,,,,0.18,English
vsafe-0-day-dose1-under-3,XKE-13029-82149,s300384501640764332967795667251311072406,06/21/2022,4:20:43 PM,0,,,,,,Good,No,,N/A,,,,,,,,None,,None,,,,,,,0.43,English
vsafe-0-day-dose1-under-3,WUD-30362-26008,s300384432152960591542194488785674877212,06/21/2022,4:22:56 PM,0,,,,,,Good,No,,N/A,,,,,,,,None,,None,,,,,,,0.42,English
vsafe-0-day-dose1-under-3,BL3-56219-49324,s300384743547636862580419215839250263261,06/21/2022,3:26:58 PM,0,,,,,,Good,No,,N/A,,,,,,,,None,,None,,,,,,,0.48,English
vsafe-0-day-dose1-under-3,B5Q-25427-25429,s300384577957106655373766105799070485248,06/21/2022,4:27:36 PM,0,,,,,,Good,No,,N/A,,,,,,,,None,,None,,,,,,,0.32,English
vsafe-0-day-dose1-under-3,237-10566-62284,s300385116244587944665115231915065626094,06/21/2022,4:30:11 PM,0,,,,,,Good,No,,N/A,,,,,,,,None,,None,,,,,,,0.23,English
vsafe-0-day-dose1-under-3,VPQ-30921-87436,s300384869510464961881154095450730169287,06/21/2022,4:31:12 PM,0,,,,,,Fair,No,,N/A,,,,,,,,None,,None,,,,,,,0.32,English
vsafe-0-day-dose1-under-3,M5E-31084-60445,s300384743548440798250462944240429870301,06/21/2022,4:32:58 PM,0,,,,,Mild,Good,No,,N/A,,,,,,,,None,,Sleepiness,,,,,,,1.97,English
vsafe-0-day-dose1-under-3,RXX-15276-50789,s300384529394254813621026928679944108173,06/21/2022,4:36:19 PM,0,,,,,,Good,No,,N/A,,,,,,,,None,,None,,,,,,,0.48,English
vsafe-1-6-daily-dose1-under-3,XEK-12085-54005,s300385303372531253995207401692499449460,06/21/2022,2:37:00 PM,1,,,,,,Good,No,,N/A,,,,,,,,None,,None,,,,,,,0.18,English
vsafe-0-day-dose1-under-3,35H-16460-84886,s300384529394453077455443727864595921037,06/21/2022,4:37:51 PM,0,,,Mild,,,Good,No,,N/A,,,,,,,,None,,Irritability/crying,,,,,,,0.52,English
vsafe-0-day-dose1-under-3,YRC-69306-28045,s300385303373034167136167087429177218676,06/21/2022,3:40:17 PM,0,,,,,,Good,No,,N/A,,,,,,,,None,,None,,,,,,,0.25,English
vsafe-0-day-dose1-under-3,9N8-32548-56441,s300385547683427436175127096973528298529,06/21/2022,4:40:53 PM,0,,,,,,Good,No,,N/A,,,,,,,,None,,None,,,,,,,0.85,English
vsafe-0-day-dose1-under-3,9XT-22701-14283,s300385547683445570062421316411148891169,06/21/2022,4:41:03 PM,0,,,,,,Good,No,,N/A,,,,,,,,None,,None,,,,,,,0.68,English
vsafe-0-day-dose1-under-3,6TJ-20814-56261,s300385547683661967784132335033421296673,06/21/2022,4:42:28 PM,0,,,,,,Good,No,,N/A,,,,,,,,None,,None,,,,,,,0.40,English
vsafe-0-day-dose1-under-3,RTD-12727-20689,s300380165178527470331851696364944288924,06/21/2022,4:43:10 PM,0,,,Mild,,,Good,No,,N/A,,,,,,,,None,,Irritability/crying,,,,,,,0.37,English
vsafe-1-6-daily-dose1-under-3,X9J-26059-18110,s300385434499104068292675422682094405785,06/21/2022,2:58:52 PM,1,,,,,Mild,Fair,Yes,,N/A,,,,,,,,None,,Sleepiness,37.4,99.3,Yes - in degrees Fahrenheit,,,,1.27,English
vsafe-1-6-daily-dose1-under-3,QG8-31931-84056,s300387022627587491895869905407354531266,06/21/2022,4:01:54 PM,1,,,,,,Good,No,,N/A,,,,,,,,None,,None,,,,,,,1.62,English
vsafe-0-day-dose1-under-3,DH2-22282-55235,s300385164219054882873927067023232925275,06/21/2022,5:05:14 PM,0,,,,,,Good,No,,N/A,,,,,,,,None,,None,,,,,,,0.25,English
vsafe-0-day-dose1-under-3,PLL-18030-81536,s300387434392932794179675960290757470956,06/21/2022,2:06:03 PM,0,,,,,,Good,No,,N/A,,,,,,,,None,,None,,,,,,,0.62,English
vsafe-0-day-dose1-under-3,LWA-18089-49622,s300387809846282863409876487530103891580,06/21/2022,2:06:19 PM,0,,,,,,Good,No,,N/A,,,,,,,,None,,None,,,,,,,1.58,English
vsafe-1-6-daily-dose1-under-3,C36-25031-72391,s300387835518706799059328725966616454011,06/21/2022,2:07:06 PM,1,,,,,,Good,No,,N/A,,,,,,,,None,,None,,,,,,,0.60,English
vsafe-0-day-dose1-under-3,7SA-29289-58556,s300387854282158666973739176753032228667,06/21/2022,2:07:38 PM,0,,,Mild,,,Fair,No,,N/A,,,,,,,Mild,Redness,,Irritability/crying,,,,,,,1.27,English
vsafe-0-day-dose1-under-3,U3P-20203-31871,s300387855840733832919177667359095280852,06/21/2022,5:09:42 PM,0,,,,,,Good,No,,N/A,,,,,,,,None,,None,,,,,,,0.53,English
vsafe-0-day-dose1-under-3,5XT-28159-71120,s300387214459382780925057354375436596833,06/21/2022,5:11:31 PM,0,,,,,,Good,No,,N/A,,,,,,,,None,,None,,,,,,,0.65,English
vsafe-0-day-dose1-under-3,LC7-33405-58339,s300387866840075132928832166442782337808,06/21/2022,5:14:42 PM,0,,,,,,Good,No,,N/A,,,,,,,,None,,None,,,,,,,3.23,English
vsafe-0-day-dose1-under-3,CY3-12052-48427,s300388126600144530544219463584248947153,06/21/2022,5:18:18 PM,0,,,,,,Fair,Yes,,Be unable to work or attend school,,,,,,,Mild,Redness,,None,37.9,100.2,Yes - in degrees Fahrenheit,,,,0.92,English
vsafe-0-day-dose1-under-3,GZD-10486-59759,s300387866841292521229184098021711457040,06/21/2022,5:21:11 PM,0,,,Mild,,,Good,No,,N/A,,,,,,,,None,,Irritability/crying,,,,,,,0.80,English
vsafe-1-6-daily-dose1-under-3,QHJ-11184-70002,s300387855080059866799610240941117022968,06/21/2022,3:21:57 PM,1,,,,,,Good,No,,N/A,,,,,,,,None,,None,,,,,,,0.70,English
vsafe-0-day-dose1-under-3,CMD-26972-28649,s300387855080433424877871161356101231352,06/21/2022,4:26:17 PM,0,,,,,,Good,No,,N/A,,,,,,,,None,,None,,,,,,,0.67,English
vsafe-0-day-dose1-under-3,E53-20460-21921,s300387849165796477583121103851056941927,06/21/2022,5:30:22 PM,0,,,,,,Good,No,,N/A,,,,,,,,None,,None,,,,,,,0.45,English
vsafe-0-day-dose1-under-3,92B-22877-73682,s300387866854410934289908856558520556498,06/21/2022,5:33:50 PM,0,,,Mild,,,Good,No,,N/A,,,,,,,,None,,Irritability/crying,,,,,,,0.58,English
vsafe-0-day-dose1-under-3,8GH-76545-88290,s300387862517614503693507042335204744299,06/21/2022,5:37:07 PM,0,,,,,,Good,No,,N/A,,,,,,,,None,,None,,,,,,,0.33,English
vsafe-0-day-dose1-under-3,GX2-24163-10234,s300390079584051147785024800510414818825,06/21/2022,5:37:37 PM,0,,,,,,Good,No,,N/A,,,,,,,,None,,None,,,,,,,0.22,English
vsafe-0-day-dose1-under-3,ZQY-16041-32688,s300390371501464483415938349697407317936,06/21/2022,5:47:07 PM,0,,,,,,Good,No,,N/A,,,,,,,,None,,None,,,,,,,1.18,English
vsafe-0-day-dose1-under-3,BBH-19037-44918,s300390368765885030295396137079333873395,06/21/2022,5:49:44 PM,0,,,,,,Good,No,,N/A,,,,,,,,None,,None,,,,,,,0.68,English
vsafe-0-day-dose1-under-3,MCX-16743-13970,s300387863141792520371524548919617572442,06/21/2022,3:51:14 PM,0,,,,,,Good,No,,N/A,,,,,,,,None,,None,,,,,,,0.65,English
vsafe-0-day-dose1-under-3,F8M-21196-51540,s300390369434469982563319688122698742651,06/21/2022,5:52:16 PM,0,,,,,,Good,No,,N/A,,,,,,,Mild,Redness,,None,,,,,,,0.47,English
vsafe-0-day-dose1-under-3,HYR-32009-78133,s300390991510547859650717647975379269517,06/21/2022,5:52:41 PM,0,,,Moderate,,,Fair,No,,N/A,,,,,,,,None,,Irritability/crying,,,,,,,2.20,English
vsafe-0-day-dose1-under-3,SQC-35502-82503,s300390991510709855710546008284789897101,06/21/2022,3:53:54 PM,0,,,,,Mild,Good,No,,N/A,,,,,Mild,,,Pain,,Sleepiness,,,,,,,0.70,English
vsafe-0-day-dose1-under-3,JN7-29823-68490,s300387853314888081972194055988544411884,06/21/2022,2:54:49 PM,0,,,,,,Good,No,,N/A,,,,,Mild,,,Pain,,None,,,,,,,0.83,English
vsafe-0-day-dose1-under-3,67T-23071-76851,s300387867324601873320531103154153648293,06/21/2022,5:57:04 PM,0,,,Mild,,,Fair,No,,N/A,,,,,,,,None,,Irritability/crying,,,,,,,1.78,English
vsafe-0-day-dose1-under-3,MRZ-20054-80014,s300391617995370712356495723688134053128,06/21/2022,6:02:34 PM,0,,,,,,Good,No,,N/A,,,,,Mild,Mild,Mild,Pain:Redness,,"Rash, not including the immediate area around the injection site",,,,,,,1.27,English
vsafe-0-day-dose1-under-3,U32-28394-23499,s300387855057960692044156279481598376902,06/21/2022,5:06:38 PM,0,,,,,,Good,No,,N/A,,,,,Mild,,,Pain:Swelling/hardness,Mild,None,,,,,,,0.68,English
vsafe-0-day-dose1-under-3,WDL-28190-50452,s300391617995855491610161189987191229704,06/21/2022,5:06:48 PM,0,,,,,,Good,No,,N/A,,,,,,,,None,,,,,,,,,0.90,English
vsafe-0-day-dose1-under-3,Y6W-28609-53548,s300391617995937698565894984771071249672,06/21/2022,3:07:27 PM,0,,,,,,Good,No,,N/A,,,,,,,,None,,None,,,,,,,1.17,English
vsafe-0-day-dose1-under-3,QBH-19173-91719,s300392168339303483213904050895597499820,06/21/2022,5:11:50 PM,0,,,,,,Good,No,,N/A,,,,,,,,None,,None,,,,,,,0.47,English
vsafe-0-day-dose1-under-3,TPB-38629-39468,s300392318318090196237233100799984939537,06/21/2022,5:12:43 PM,0,,,,,,Good,No,,N/A,,,,,,,,None,,None,,,,,,,0.35,English
vsafe-0-day-dose1-under-3,DSF-30710-34906,s300392318318319892142959880343179112977,06/21/2022,6:14:42 PM,0,,,,,,Good,No,,N/A,,,,,,,,None,,None,,,,,,,0.18,English
vsafe-0-day-dose1-under-3,HUG-10252-06247,s300392168339701219808557263894075831724,06/21/2022,6:15:46 PM,0,,,,,,Good,No,,N/A,,,,,,,,None,,None,,,,,,,0.27,English
vsafe-0-day-dose1-under-3,JCH-20806-11953,s300392318318658391372451976512096842257,06/21/2022,5:18:40 PM,0,,,,,,Good,No,,N/A,,,,,,,Mild,Redness,,None,,,,,,,0.83,English
vsafe-0-day-dose1-under-3,AP3-23067-75642,s300393045201053900847020691343255681382,06/21/2022,5:23:57 PM,0,,,,,,Fair,Yes,,Be unable to work or attend school,,,,,,,,None,,,37.8,100.0,Yes - in degrees Fahrenheit,,,,1.97,English
vsafe-0-day-dose1-under-3,NL3-19945-80282,s300393262894919395343247401547593293970,06/21/2022,5:29:14 PM,0,,,,,,Good,No,,N/A,,,,,,,,None,,None,,,,,,,0.80,English
vsafe-0-day-dose1-under-3,NEL-18046-61036,s300391366222380405911050931768547534799,06/21/2022,6:29:37 PM,0,,,,,,Good,No,,N/A,,,,,,,,None,,None,,,,,,,0.48,English
vsafe-0-day-dose1-under-3,KV9-19904-55332,s300393349134965069214186147767344838144,06/21/2022,6:30:19 PM,0,,,,,,Good,No,,N/A,,,,,,,,None,,None,,,,,,,0.55,English
vsafe-0-day-dose1-under-3,29F-17895-17615,s300387855420859119814333449190538615289,06/21/2022,4:30:30 PM,0,,,,,,Good,No,,N/A,,,,,,,,None,,None,,,,,,,1.10,English
vsafe-1-6-daily-dose1-under-3,AS3-28915-27084,s300393262895141837694056493315739230354,06/21/2022,3:32:10 PM,1,,,,,Mild,Good,No,,N/A,,,,,,,,None,,Sleepiness,,,,,,,1.02,English
vsafe-0-day-dose1-under-3,2DN-21296-16950,s300387855421094860349158301879606319609,06/21/2022,6:33:39 PM,0,,,,,,Good,No,,N/A,,,,,,,,None,,None,,,,,,,1.47,English
vsafe-0-day-dose1-under-3,G5A-18918-40466,s300393417496905017522992006659268294092,06/21/2022,3:35:25 PM,0,,,,,,Good,No,,N/A,,,,,,,,None,,None,,,,,,,1.17,English
vsafe-0-day-dose1-under-3,24Q-70049-43315,s300393418614337990750314905613950919581,06/21/2022,4:36:58 PM,0,,,,,,Good,No,,N/A,,,,,,,,None,,None,,,,,,,0.47,English
vsafe-0-day-dose1-under-3,WCP-27420-51081,s300393262895672556128867315523435241618,06/21/2022,5:37:00 PM,0,,,,,,Good,No,,N/A,,,,,,,,None,,None,,,,,,,0.38,English
vsafe-0-day-dose1-under-3,HC5-14633-05244,s300393214066285695471373475633276057211,06/21/2022,5:39:55 PM,0,,,,,,Good,No,,N/A,,,,,Mild,,,Pain,,None,,,,,,,0.45,English
vsafe-0-day-dose1-under-3,3E8-84153-81337,s300394488287092584188940397251067049913,06/21/2022,6:40:28 PM,0,,,Mild,,,Good,No,,N/A,,,,,Mild,,Mild,Pain:Redness:Swelling/hardness,Mild,Irritability/crying,,,,,,,1.02,English
vsafe-0-day-dose1-under-3,CQQ-32547-37671,s300393214066452527234480294459385509499,06/21/2022,6:41:35 PM,0,,,,,Mild,Good,No,,N/A,,,,,,,,None,,Sleepiness,,,,,,,0.73,English
vsafe-0-day-dose1-under-3,G43-24882-63848,s300393454772346978971679869034354628979,06/21/2022,6:42:26 PM,0,,,Mild,,,Good,No,,N/A,,,,,Mild,,Mild,Pain:Redness:Swelling/hardness,Mild,Irritability/crying,,,,,,,0.37,English
vsafe-0-day-dose1-under-3,S7Y-24031-90738,s300394594315978480630868725724531567050,06/21/2022,5:45:43 PM,0,,,,,,Good,No,,N/A,,,,,,,,None,,None,,,,,,,0.62,English
vsafe-0-day-dose1-under-3,TJ6-22024-28580,s300395326158042498860333152570805215823,06/21/2022,6:51:16 PM,0,,,,,,Good,No,,N/A,,,,,,,,None,,None,,,,,,,0.30,English
vsafe-1-6-daily-dose1-under-3,JP5-23280-87736,s300394594316462050958714577394414037450,06/21/2022,3:52:12 PM,1,,,,,,Good,No,,N/A,,,,,,,,None,,None,,,,,,,0.28,English
vsafe-0-day-dose1-under-3,VWJ-83620-03643,s300395324823553898101378145423737942452,06/21/2022,6:54:40 PM,0,,,,,,Good,No,,N/A,,,,,,,,None,,None,,,,,,,0.32,English
vsafe-0-day-dose1-under-3,79Z-24459-66607,s300395828158168996076677700992600002412,06/21/2022,6:57:54 PM,0,,,,,,Good,No,,N/A,,,,,Mild,,,Pain,,None,,,,,,,0.30,English
vsafe-0-day-dose1-under-3,KGF-15241-99629,s300396337443239673300740679911567185335,06/21/2022,7:05:40 PM,0,,,,,,Fair,No,,N/A,,,,,,,,None,,None,,,,,,,0.65,English
vsafe-0-day-dose1-under-3,VZF-21462-24264,s300396655001223699405597717281651740036,06/21/2022,7:08:15 PM,0,,,Mild,,,Good,No,,N/A,,,,,Mild,,,Pain,,Irritability/crying,,,,,,,0.55,English
vsafe-0-day-dose1-under-3,T5Z-47480-07196,s300395828158993483485654878089749614444,06/21/2022,7:08:30 PM,0,,,,,,Good,No,,N/A,,,,,,,,None,,None,,,,,,,0.43,English
vsafe-0-day-dose1-under-3,9AC-26584-82373,s300396515555457271796502229658804846023,06/21/2022,7:14:20 PM,0,,,,,,Good,No,,N/A,,,,,,,,None,,None,,,,,,,0.37,English
vsafe-0-day-dose1-under-3,AMH-73055-24091,s300396655001876519348189617035993075076,06/21/2022,4:17:34 PM,0,,,,,,Good,No,,N/A,,,,,,,,None,,None,,,,,,,0.47,English
vsafe-0-day-dose1-under-3,823-21074-78227,s300396337185224829612775213126140965884,06/21/2022,7:18:03 PM,0,,,,,,Good,No,,N/A,,,,,,,,None,,None,,,,,,,0.40,English
vsafe-0-day-dose1-under-3,FAC-20869-52370,s300396396491597803035017127343352889455,06/21/2022,7:23:34 PM,0,,,,,,Good,No,,N/A,,,,,,,,None,,None,,,,,,,2.02,English
vsafe-0-day-dose1-under-3,46P-79700-77630,s300397286926696486391843488851850580094,06/21/2022,7:24:36 PM,0,,,,,,Fair,No,,N/A,,,,,,,,None,,None,,,,,,,0.33,English